{"text_format":"1","workbook":"xlsx","n_sheets":3,"sheets":["Geral","ResultadosGeral corrida fasiada","FolhaRegistoNatação"],"not_rendered":{"charts":0,"images":2,"macros":1,"external_links":0,"defined_names":3,"comments":2,"pivot_tables":0},"unopened":[],"bounds":{"document_bytes":16777216,"sheet_cells":100000,"rows_first":2000,"rows_last":500,"rows_between":2000,"halvings":0,"cell_chars":16384,"cell_head_chars":4096},"cells_cut":0,"cells_raw":0,"read":"whole","date_system":"1900"}

{"sheet":"Geral","index":0,"n_rows":211,"n_cols":10,"rows_kept":211,"cut":false,"hidden":false,"merged":[[199,3,199,5]]}
[]
[]
[]
[]
[null,null,null,null,"I AQUATLO DO LXTRIATHLON - CIRCUITO JOVEM CENTRO LITORAL - 1ª ETAPA"]
[null,null,null,null,"11 DE FEVEREIRO DE 2018"]
[]
[null,null,null,null,"BENJAMINS MASCULINOS"]
["Pos","Dorsal ","Licença","Escalão","Nome","Género","Clube","Tempo Natação","Tempo Corrida","Tempo Final"]
[1,836,103904,"BEN","Martim da Silva Chéu Rodrigues","M","Associação Naval Amorense/ Não da Região","00:00:49","00:01:15","00:02:04"]
[2,852,104632,"BEN","Luís Viriato Gonzaga dos Anjos","M","Sport Lisboa e Benfica","00:00:52.560","00:01:21.340","00:02:13.900"]
[3,5569,0,"BEN","António Picoto","M","CSJB/ Não Federado","00:00:50.170","00:01:24.240","00:02:14.410"]
[4,5568,0,"BEN","Francisco Almeida","M","CSJB/ Não Federado","00:00:50.680","00:01:23.900","00:02:14.580"]
[5,6046,0,"BEN","Rodrigo Paulos Pereira Barreto","M","Não Federado","00:00:51","00:01:25","00:02:16"]
[6,5551,0,"BEN","Duarte Magalhães Filipe","M","Clube Futebol “Os Belenenses”/Não federado","00:00:57","00:01:20","00:02:17"]
[7,5685,0,"BEN","Santiago Pereira Gaspar","M","Não Federado","00:01:07","00:01:15","00:02:22"]
[8,16,103866,"BEN","Afonso Magalhães Silva","M","Lxtriathlon","00:00:52","00:01:32","00:02:24"]
[9,325,103405,"BEN","João António Queixada Prudêncio","M","Sport Lisboa e Benfica","00:01:05","00:01:21","00:02:26"]
[10,134,104164,"BEN","Edson Tavares","M","Clube de Natação da Amadora","00:01:07","00:01:20","00:02:27"]
[11,46,103164,"BEN","Denis Rodrigues Fragoso","M","Associação Naval Amorense/ Não federado","00:01:06","00:01:35","00:02:41"]
[12,5504,105088,"BEN","Francisco Barreiro","M","Clube de Natação da Amadora","00:01:08","00:01:36","00:02:44"]
[13,6073,0,"BEN","Francisco Duarte da Silva Leão","M","Não Federado","00:01:05","00:01:41","00:02:46"]
[14,132,104161,"BEN","Rodrigo Paulos","M","Clube de Natação da Amadora","00:01:06","00:01:41","00:02:47"]
[15,5684,0,"BEN","Gonçalo Santos Chitas","M","Não Federado","00:01:10","00:01:39","00:02:49"]
[16,136,104166,"BEN","Samuel Parisot","M","Clube de Natação da Amadora","00:01:11","00:01:54","00:03:05"]
[17,246,104198,"BEN","Tiago Catarino Craveiro Ferreira","M","Sport Lisboa e Benfica","00:01:17","00:01:51","00:03:08"]
["",null,"","","","","","","",""]
[]
[null,null,null,null,"BENJAMINS FEMININOS"]
["Pos","Dorsal ","Licença","Escalão","Nome","Género","Clube","Tempo Natação","Tempo Corrida","Tempo Final"]
[1,109,103257,"BEN","Benedita Vaz","F","SFRAA","00:00:43","00:01:25","00:02:08"]
[2,754,103758,"BEN","Laura Maria Nunes Aranha","F","Sport Lisboa e Benfica/ Não federado","00:00:53","00:01:20","00:02:13"]
[3,936,104691,"BEN","Maria Inês Duarte Nogueira","F","Sport Lisboa e Benfica","00:00:57","00:01:25","00:02:22"]
[4,6133,0,"BEN","Isabel Marques","F","Peniche Amigos Clube - Não Federado","00:00:55","00:01:29","00:02:24"]
[5,561,104447,"BEN","Catarina Silva","F","SFRAA","00:01:07","00:01:33","00:02:40"]
[6,940,104692,"BEN","Gabriela Marques dos Santos","F","Sport Lisboa e Benfica/ Não federado","00:01:09","00:01:32","00:02:41"]
[7,251,104200,"BEN","Maria Rita Queixada Prudêncio","F","Sport Lisboa e Benfica","00:01:15","00:01:29","00:02:44"]
[8,931,104690,"BEN","Beatriz Marques Martins","F","Sport Lisboa e Benfica","00:01:31","00:01:36","00:03:07"]
[9,6135,104488,"BEN","Vânia Pereira Crispim","F","Sport Lisboa e Benfica","00:01:38","00:01:41","00:03:19"]
[]
{"$rows_left_out":172}
{"sheet":"ResultadosGeral corrida fasiada","index":1,"n_rows":240,"n_cols":11,"rows_kept":240,"cut":false,"hidden":true,"merged":[[226,0,226,10],[228,1,228,2],[228,3,228,4],[228,5,228,6],[228,7,228,9],[213,1,213,2],[213,5,213,6],[213,7,213,9],[213,3,213,4],[211,0,211,10],[0,0,0,10],[1,0,1,10],[3,0,3,10],[187,0,187,10],[27,0,27,10],[51,0,51,10],[88,0,88,10],[112,0,112,10],[136,0,136,10],[160,0,160,10]]}
["I AQUATLO DO LXTRIATHLON - CIRCUITO JOVEM CENTRO LITORAL - 1ª ETAPA"]
["11 DE FEVEREIRO DE 2018"]
[]
["BENJAMINS MASCULINOS"]
[]
["Pos","Dorsal ","Licença","Escalão","Nome","Género","Clube","Tempo Natação","Tempo Corrida","Tempo Final","Pontos"]
[{"$f":"IF(J7=\"\",\"\",RANK(J7,$J$7:$J$26,1))","v":""},null,{"$f":"IFERROR((VLOOKUP(B7,#REF!,2,FALSE)),\"\")","v":""},{"$f":"IFERROR((VLOOKUP(B7,#REF!,3,FALSE)),\"\")","v":""},{"$f":"IFERROR((VLOOKUP(B7,#REF!,4,FALSE)),\"\")","v":""},{"$f":"IFERROR((VLOOKUP(B7,#REF!,6,FALSE)),\"\")","v":""},{"$f":"IFERROR((VLOOKUP(B7,#REF!,8,FALSE)),\"\")","v":""},{"$f":"IFERROR((VLOOKUP(B7,#REF!,7,FALSE)),\"\")","v":""},null,{"$f":"IF(B7=\"\",\"\",H7+I7)","v":""},{"$f":"IF(B7>0,\"100\",\"\")","v":""}]
["",null,{"$f":"IFERROR((VLOOKUP(B8,#REF!,2,FALSE)),\"\")","v":""},{"$f":"IFERROR((VLOOKUP(B8,#REF!,3,FALSE)),\"\")","v":""},{"$f":"IFERROR((VLOOKUP(B8,#REF!,4,FALSE)),\"\")","v":""},{"$f":"IFERROR((VLOOKUP(B8,#REF!,6,FALSE)),\"\")","v":""},{"$f":"IFERROR((VLOOKUP(B8,#REF!,8,FALSE)),\"\")","v":""},{"$f":"IFERROR((VLOOKUP(B8,#REF!,7,FALSE)),\"\")","v":""},null,"",{"$f":"IF(B8>0,K7-1,\"\")","v":""}]
["",null,{"$f":"IFERROR((VLOOKUP(B9,#REF!,2,FALSE)),\"\")","v":""},{"$f":"IFERROR((VLOOKUP(B9,#REF!,3,FALSE)),\"\")","v":""},{"$f":"IFERROR((VLOOKUP(B9,#REF!,4,FALSE)),\"\")","v":""},{"$f":"IFERROR((VLOOKUP(B9,#REF!,6,FALSE)),\"\")","v":""},{"$f":"IFERROR((VLOOKUP(B9,#REF!,8,FALSE)),\"\")","v":""},{"$f":"IFERROR((VLOOKUP(B9,#REF!,7,FALSE)),\"\")","v":""},null,"",""]
["",null,{"$f":"IFERROR((VLOOKUP(B10,#REF!,2,FALSE)),\"\")","v":""},{"$f":"IFERROR((VLOOKUP(B10,#REF!,3,FALSE)),\"\")","v":""},{"$f":"IFERROR((VLOOKUP(B10,#REF!,4,FALSE)),\"\")","v":""},{"$f":"IFERROR((VLOOKUP(B10,#REF!,6,FALSE)),\"\")","v":""},{"$f":"IFERROR((VLOOKUP(B10,#REF!,8,FALSE)),\"\")","v":""},{"$f":"IFERROR((VLOOKUP(B10,#REF!,7,FALSE)),\"\")","v":""},null,"",""]
["",null,{"$f":"IFERROR((VLOOKUP(B11,#REF!,2,FALSE)),\"\")","v":""},{"$f":"IFERROR((VLOOKUP(B11,#REF!,3,FALSE)),\"\")","v":""},{"$f":"IFERROR((VLOOKUP(B11,#REF!,4,FALSE)),\"\")","v":""},{"$f":"IFERROR((VLOOKUP(B11,#REF!,6,FALSE)),\"\")","v":""},{"$f":"IFERROR((VLOOKUP(B11,#REF!,8,FALSE)),\"\")","v":""},{"$f":"IFERROR((VLOOKUP(B11,#REF!,7,FALSE)),\"\")","v":""},null,"",""]
["",null,{"$f":"IFERROR((VLOOKUP(B12,#REF!,2,FALSE)),\"\")","v":""},{"$f":"IFERROR((VLOOKUP(B12,#REF!,3,FALSE)),\"\")","v":""},{"$f":"IFERROR((VLOOKUP(B12,#REF!,4,FALSE)),\"\")","v":""},{"$f":"IFERROR((VLOOKUP(B12,#REF!,6,FALSE)),\"\")","v":""},{"$f":"IFERROR((VLOOKUP(B12,#REF!,8,FALSE)),\"\")","v":""},{"$f":"IFERROR((VLOOKUP(B12,#REF!,7,FALSE)),\"\")","v":""},null,"",""]
["",null,{"$f":"IFERROR((VLOOKUP(B13,#REF!,2,FALSE)),\"\")","v":""},{"$f":"IFERROR((VLOOKUP(B13,#REF!,3,FALSE)),\"\")","v":""},{"$f":"IFERROR((VLOOKUP(B13,#REF!,4,FALSE)),\"\")","v":""},{"$f":"IFERROR((VLOOKUP(B13,#REF!,6,FALSE)),\"\")","v":""},{"$f":"IFERROR((VLOOKUP(B13,#REF!,8,FALSE)),\"\")","v":""},{"$f":"IFERROR((VLOOKUP(B13,#REF!,7,FALSE)),\"\")","v":""},null,"",""]
["",null,{"$f":"IFERROR((VLOOKUP(B14,#REF!,2,FALSE)),\"\")","v":""},{"$f":"IFERROR((VLOOKUP(B14,#REF!,3,FALSE)),\"\")","v":""},{"$f":"IFERROR((VLOOKUP(B14,#REF!,4,FALSE)),\"\")","v":""},{"$f":"IFERROR((VLOOKUP(B14,#REF!,6,FALSE)),\"\")","v":""},{"$f":"IFERROR((VLOOKUP(B14,#REF!,8,FALSE)),\"\")","v":""},{"$f":"IFERROR((VLOOKUP(B14,#REF!,7,FALSE)),\"\")","v":""},null,"",""]
["",null,{"$f":"IFERROR((VLOOKUP(B15,#REF!,2,FALSE)),\"\")","v":""},{"$f":"IFERROR((VLOOKUP(B15,#REF!,3,FALSE)),\"\")","v":""},{"$f":"IFERROR((VLOOKUP(B15,#REF!,4,FALSE)),\"\")","v":""},{"$f":"IFERROR((VLOOKUP(B15,#REF!,6,FALSE)),\"\")","v":""},{"$f":"IFERROR((VLOOKUP(B15,#REF!,8,FALSE)),\"\")","v":""},{"$f":"IFERROR((VLOOKUP(B15,#REF!,7,FALSE)),\"\")","v":""},null,"",""]
["",null,{"$f":"IFERROR((VLOOKUP(B16,#REF!,2,FALSE)),\"\")","v":""},{"$f":"IFERROR((VLOOKUP(B16,#REF!,3,FALSE)),\"\")","v":""},{"$f":"IFERROR((VLOOKUP(B16,#REF!,4,FALSE)),\"\")","v":""},{"$f":"IFERROR((VLOOKUP(B16,#REF!,6,FALSE)),\"\")","v":""},{"$f":"IFERROR((VLOOKUP(B16,#REF!,8,FALSE)),\"\")","v":""},{"$f":"IFERROR((VLOOKUP(B16,#REF!,7,FALSE)),\"\")","v":""},null,"",""]
["",null,{"$f":"IFERROR((VLOOKUP(B17,#REF!,2,FALSE)),\"\")","v":""},{"$f":"IFERROR((VLOOKUP(B17,#REF!,3,FALSE)),\"\")","v":""},{"$f":"IFERROR((VLOOKUP(B17,#REF!,4,FALSE)),\"\")","v":""},{"$f":"IFERROR((VLOOKUP(B17,#REF!,6,FALSE)),\"\")","v":""},{"$f":"IFERROR((VLOOKUP(B17,#REF!,8,FALSE)),\"\")","v":""},{"$f":"IFERROR((VLOOKUP(B17,#REF!,7,FALSE)),\"\")","v":""},null,"",""]
["",null,{"$f":"IFERROR((VLOOKUP(B18,#REF!,2,FALSE)),\"\")","v":""},{"$f":"IFERROR((VLOOKUP(B18,#REF!,3,FALSE)),\"\")","v":""},{"$f":"IFERROR((VLOOKUP(B18,#REF!,4,FALSE)),\"\")","v":""},{"$f":"IFERROR((VLOOKUP(B18,#REF!,6,FALSE)),\"\")","v":""},{"$f":"IFERROR((VLOOKUP(B18,#REF!,8,FALSE)),\"\")","v":""},{"$f":"IFERROR((VLOOKUP(B18,#REF!,7,FALSE)),\"\")","v":""},null,"",""]
["",null,{"$f":"IFERROR((VLOOKUP(B19,#REF!,2,FALSE)),\"\")","v":""},{"$f":"IFERROR((VLOOKUP(B19,#REF!,3,FALSE)),\"\")","v":""},{"$f":"IFERROR((VLOOKUP(B19,#REF!,4,FALSE)),\"\")","v":""},{"$f":"IFERROR((VLOOKUP(B19,#REF!,6,FALSE)),\"\")","v":""},{"$f":"IFERROR((VLOOKUP(B19,#REF!,8,FALSE)),\"\")","v":""},{"$f":"IFERROR((VLOOKUP(B19,#REF!,7,FALSE)),\"\")","v":""},null,"",""]
["",null,{"$f":"IFERROR((VLOOKUP(B20,#REF!,2,FALSE)),\"\")","v":""},{"$f":"IFERROR((VLOOKUP(B20,#REF!,3,FALSE)),\"\")","v":""},{"$f":"IFERROR((VLOOKUP(B20,#REF!,4,FALSE)),\"\")","v":""},{"$f":"IFERROR((VLOOKUP(B20,#REF!,6,FALSE)),\"\")","v":""},{"$f":"IFERROR((VLOOKUP(B20,#REF!,8,FALSE)),\"\")","v":""},{"$f":"IFERROR((VLOOKUP(B20,#REF!,7,FALSE)),\"\")","v":""},null,"",""]
["",null,{"$f":"IFERROR((VLOOKUP(B21,#REF!,2,FALSE)),\"\")","v":""},{"$f":"IFERROR((VLOOKUP(B21,#REF!,3,FALSE)),\"\")","v":""},{"$f":"IFERROR((VLOOKUP(B21,#REF!,4,FALSE)),\"\")","v":""},{"$f":"IFERROR((VLOOKUP(B21,#REF!,6,FALSE)),\"\")","v":""},{"$f":"IFERROR((VLOOKUP(B21,#REF!,8,FALSE)),\"\")","v":""},{"$f":"IFERROR((VLOOKUP(B21,#REF!,7,FALSE)),\"\")","v":""},null,"",""]
["",null,{"$f":"IFERROR((VLOOKUP(B22,#REF!,2,FALSE)),\"\")","v":""},{"$f":"IFERROR((VLOOKUP(B22,#REF!,3,FALSE)),\"\")","v":""},{"$f":"IFERROR((VLOOKUP(B22,#REF!,4,FALSE)),\"\")","v":""},{"$f":"IFERROR((VLOOKUP(B22,#REF!,6,FALSE)),\"\")","v":""},{"$f":"IFERROR((VLOOKUP(B22,#REF!,8,FALSE)),\"\")","v":""},{"$f":"IFERROR((VLOOKUP(B22,#REF!,7,FALSE)),\"\")","v":""},null,"",""]
["",null,{"$f":"IFERROR((VLOOKUP(B23,#REF!,2,FALSE)),\"\")","v":""},{"$f":"IFERROR((VLOOKUP(B23,#REF!,3,FALSE)),\"\")","v":""},{"$f":"IFERROR((VLOOKUP(B23,#REF!,4,FALSE)),\"\")","v":""},{"$f":"IFERROR((VLOOKUP(B23,#REF!,6,FALSE)),\"\")","v":""},{"$f":"IFERROR((VLOOKUP(B23,#REF!,8,FALSE)),\"\")","v":""},{"$f":"IFERROR((VLOOKUP(B23,#REF!,7,FALSE)),\"\")","v":""},null,"",""]
["",null,{"$f":"IFERROR((VLOOKUP(B24,#REF!,2,FALSE)),\"\")","v":""},{"$f":"IFERROR((VLOOKUP(B24,#REF!,3,FALSE)),\"\")","v":""},{"$f":"IFERROR((VLOOKUP(B24,#REF!,4,FALSE)),\"\")","v":""},{"$f":"IFERROR((VLOOKUP(B24,#REF!,6,FALSE)),\"\")","v":""},{"$f":"IFERROR((VLOOKUP(B24,#REF!,8,FALSE)),\"\")","v":""},{"$f":"IFERROR((VLOOKUP(B24,#REF!,7,FALSE)),\"\")","v":""},null,"",""]
["",null,{"$f":"IFERROR((VLOOKUP(B25,#REF!,2,FALSE)),\"\")","v":""},{"$f":"IFERROR((VLOOKUP(B25,#REF!,3,FALSE)),\"\")","v":""},{"$f":"IFERROR((VLOOKUP(B25,#REF!,4,FALSE)),\"\")","v":""},{"$f":"IFERROR((VLOOKUP(B25,#REF!,6,FALSE)),\"\")","v":""},{"$f":"IFERROR((VLOOKUP(B25,#REF!,8,FALSE)),\"\")","v":""},{"$f":"IFERROR((VLOOKUP(B25,#REF!,7,FALSE)),\"\")","v":""},null,"",""]
["",null,{"$f":"IFERROR((VLOOKUP(B26,#REF!,2,FALSE)),\"\")","v":""},{"$f":"IFERROR((VLOOKUP(B26,#REF!,3,FALSE)),\"\")","v":""},{"$f":"IFERROR((VLOOKUP(B26,#REF!,4,FALSE)),\"\")","v":""},{"$f":"IFERROR((VLOOKUP(B26,#REF!,6,FALSE)),\"\")","v":""},{"$f":"IFERROR((VLOOKUP(B26,#REF!,8,FALSE)),\"\")","v":""},{"$f":"IFERROR((VLOOKUP(B26,#REF!,7,FALSE)),\"\")","v":""},null,"",""]
[]
["BENJAMINS FEMININOS"]
[]
["Pos","Dorsal ","Licença","Escalão","Nome","Género","Clube","Tempo Natação","Tempo Corrida","Tempo Final","Pontos"]
[{"$f":"IF(J31=\"\",\"\",RANK(J31,$J$31:$J$50,1))","v":""},null,{"$f":"IFERROR((VLOOKUP(B31,#REF!,2,FALSE)),\"\")","v":""},{"$f":"IFERROR((VLOOKUP(B31,#REF!,3,FALSE)),\"\")","v":""},{"$f":"IFERROR((VLOOKUP(B31,#REF!,4,FALSE)),\"\")","v":""},{"$f":"IFERROR((VLOOKUP(B31,#REF!,6,FALSE)),\"\")","v":""},{"$f":"IFERROR((VLOOKUP(B31,#REF!,8,FALSE)),\"\")","v":""},{"$f":"IFERROR((VLOOKUP(B31,#REF!,7,FALSE)),\"\")","v":""},null,{"$f":"IF(B31=\"\",\"\",H31+I31)","v":""},{"$f":"IF(B31>0,\"100\",\"\")","v":""}]
[{"$f":"IF(J32=\"\",\"\",RANK(J32,$J$31:$J$50,1))","v":""},null,{"$f":"IFERROR((VLOOKUP(B32,#REF!,2,FALSE)),\"\")","v":""},{"$f":"IFERROR((VLOOKUP(B32,#REF!,3,FALSE)),\"\")","v":""},{"$f":"IFERROR((VLOOKUP(B32,#REF!,4,FALSE)),\"\")","v":""},{"$f":"IFERROR((VLOOKUP(B32,#REF!,6,FALSE)),\"\")","v":""},{"$f":"IFERROR((VLOOKUP(B32,#REF!,8,FALSE)),\"\")","v":""},{"$f":"IFERROR((VLOOKUP(B32,#REF!,7,FALSE)),\"\")","v":""},null,"",{"$f":"IF(B32>0,K31-1,\"\")","v":""}]
[{"$f":"IF(J33=\"\",\"\",RANK(J33,$J$31:$J$50,1))","v":""},null,{"$f":"IFERROR((VLOOKUP(B33,#REF!,2,FALSE)),\"\")","v":""},{"$f":"IFERROR((VLOOKUP(B33,#REF!,3,FALSE)),\"\")","v":""},{"$f":"IFERROR((VLOOKUP(B33,#REF!,4,FALSE)),\"\")","v":""},{"$f":"IFERROR((VLOOKUP(B33,#REF!,6,FALSE)),\"\")","v":""},{"$f":"IFERROR((VLOOKUP(B33,#REF!,8,FALSE)),\"\")","v":""},{"$f":"IFERROR((VLOOKUP(B33,#REF!,7,FALSE)),\"\")","v":""},null,"",""]
["",null,{"$f":"IFERROR((VLOOKUP(B34,#REF!,2,FALSE)),\"\")","v":""},{"$f":"IFERROR((VLOOKUP(B34,#REF!,3,FALSE)),\"\")","v":""},{"$f":"IFERROR((VLOOKUP(B34,#REF!,4,FALSE)),\"\")","v":""},{"$f":"IFERROR((VLOOKUP(B34,#REF!,6,FALSE)),\"\")","v":""},{"$f":"IFERROR((VLOOKUP(B34,#REF!,8,FALSE)),\"\")","v":""},{"$f":"IFERROR((VLOOKUP(B34,#REF!,7,FALSE)),\"\")","v":""},null,"",""]
["",null,{"$f":"IFERROR((VLOOKUP(B35,#REF!,2,FALSE)),\"\")","v":""},{"$f":"IFERROR((VLOOKUP(B35,#REF!,3,FALSE)),\"\")","v":""},{"$f":"IFERROR((VLOOKUP(B35,#REF!,4,FALSE)),\"\")","v":""},{"$f":"IFERROR((VLOOKUP(B35,#REF!,6,FALSE)),\"\")","v":""},{"$f":"IFERROR((VLOOKUP(B35,#REF!,8,FALSE)),\"\")","v":""},{"$f":"IFERROR((VLOOKUP(B35,#REF!,7,FALSE)),\"\")","v":""},null,"",""]
["",null,{"$f":"IFERROR((VLOOKUP(B36,#REF!,2,FALSE)),\"\")","v":""},{"$f":"IFERROR((VLOOKUP(B36,#REF!,3,FALSE)),\"\")","v":""},{"$f":"IFERROR((VLOOKUP(B36,#REF!,4,FALSE)),\"\")","v":""},{"$f":"IFERROR((VLOOKUP(B36,#REF!,6,FALSE)),\"\")","v":""},{"$f":"IFERROR((VLOOKUP(B36,#REF!,8,FALSE)),\"\")","v":""},{"$f":"IFERROR((VLOOKUP(B36,#REF!,7,FALSE)),\"\")","v":""},null,"",""]
["",null,{"$f":"IFERROR((VLOOKUP(B37,#REF!,2,FALSE)),\"\")","v":""},{"$f":"IFERROR((VLOOKUP(B37,#REF!,3,FALSE)),\"\")","v":""},{"$f":"IFERROR((VLOOKUP(B37,#REF!,4,FALSE)),\"\")","v":""},{"$f":"IFERROR((VLOOKUP(B37,#REF!,6,FALSE)),\"\")","v":""},{"$f":"IFERROR((VLOOKUP(B37,#REF!,9,FALSE)),\"\")","v":""},{"$f":"IFERROR((VLOOKUP(B37,#REF!,7,FALSE)),\"\")","v":""},null,"",""]
["",null,{"$f":"IFERROR((VLOOKUP(B38,#REF!,2,FALSE)),\"\")","v":""},{"$f":"IFERROR((VLOOKUP(B38,#REF!,3,FALSE)),\"\")","v":""},{"$f":"IFERROR((VLOOKUP(B38,#REF!,4,FALSE)),\"\")","v":""},{"$f":"IFERROR((VLOOKUP(B38,#REF!,6,FALSE)),\"\")","v":""},{"$f":"IFERROR((VLOOKUP(B38,#REF!,9,FALSE)),\"\")","v":""},{"$f":"IFERROR((VLOOKUP(B38,#REF!,7,FALSE)),\"\")","v":""},null,"",""]
["",null,{"$f":"IFERROR((VLOOKUP(B39,#REF!,2,FALSE)),\"\")","v":""},{"$f":"IFERROR((VLOOKUP(B39,#REF!,3,FALSE)),\"\")","v":""},{"$f":"IFERROR((VLOOKUP(B39,#REF!,4,FALSE)),\"\")","v":""},{"$f":"IFERROR((VLOOKUP(B39,#REF!,6,FALSE)),\"\")","v":""},{"$f":"IFERROR((VLOOKUP(B39,#REF!,9,FALSE)),\"\")","v":""},{"$f":"IFERROR((VLOOKUP(B39,#REF!,7,FALSE)),\"\")","v":""},null,"",""]
["",null,{"$f":"IFERROR((VLOOKUP(B40,#REF!,2,FALSE)),\"\")","v":""},{"$f":"IFERROR((VLOOKUP(B40,#REF!,3,FALSE)),\"\")","v":""},{"$f":"IFERROR((VLOOKUP(B40,#REF!,4,FALSE)),\"\")","v":""},{"$f":"IFERROR((VLOOKUP(B40,#REF!,6,FALSE)),\"\")","v":""},{"$f":"IFERROR((VLOOKUP(B40,#REF!,9,FALSE)),\"\")","v":""},{"$f":"IFERROR((VLOOKUP(B40,#REF!,7,FALSE)),\"\")","v":""},null,"",""]
{"$rows_left_out":201}
{"sheet":"FolhaRegistoNatação","index":2,"n_rows":32,"n_cols":20,"rows_kept":32,"cut":false,"hidden":true,"merged":[[0,0,0,17],[1,0,1,17]]}
["I AQUATLO DO LXTRIATHLON - CIRCUITO JOVEM CENTRO LITORAL - 1ª ETAPA"]
["11 DE FEVEREIRO DE 2018"]
[]
[null,null,null,null,null,null,null,null,"Nº de Pista:"]
[]
[null,null,null,null,null,"Nº de Serie:",1,null,null,null,null,null,"Nome do Arbrito:"]
["BEN.","M","BEN.","F","INF","M","INF","F","INI","M","INI","F","JUV","M","JUV","F","EST","BEN/INF","EST","INI/JUV"]
["Dorsal ","Tempo Natação","Dorsal ","Tempo Natação","Dorsal ","Tempo Natação","Dorsal ","Tempo Natação","Dorsal ","Tempo Natação","Dorsal ","Tempo Natação","Dorsal ","Tempo Natação","Dorsal ","Tempo Natação","Dorsal ","Tempo Natação","Dorsal ","Tempo Natação"]
[]
[]
[null,null,null,null,null,"Nº de Serie:",2]
["BEN.","M","BEN.","F","INF","M","INF","F","INI","M","INI","F","JUV","M","JUV","M","EST","BEN/INF","EST","INI/JUV"]
["Dorsal ","Tempo Natação","Dorsal ","Tempo Natação","Dorsal ","Tempo Natação","Dorsal ","Tempo Natação","Dorsal ","Tempo Natação","Dorsal ","Tempo Natação","Dorsal ","Tempo Natação","Dorsal ","Tempo Natação","Dorsal ","Tempo Natação","Dorsal ","Tempo Natação"]
[]
[]
[null,null,null,null,null,"Nº de Serie:",3]
["BEN.","M","BEN.","F","INF","M","INF","F","INI","M","INI","F","JUV","M","JUV","M","EST","BEN/INF","EST","INI/JUV"]
["Dorsal ","Tempo Natação","Dorsal ","Tempo Natação","Dorsal ","Tempo Natação","Dorsal ","Tempo Natação","Dorsal ","Tempo Natação","Dorsal ","Tempo Natação","Dorsal ","Tempo Natação","Dorsal ","Tempo Natação","Dorsal ","Tempo Natação","Dorsal ","Tempo Natação"]
[]
[]
[null,null,null,null,null,"Nº de Serie:",4]
["BEN.","M","BEN.","F","INF","M","INF","F","INI","M","INI","F","JUV","M","JUV","M","EST","BEN/INF","EST","INI/JUV"]
["Dorsal ","Tempo Natação","Dorsal ","Tempo Natação","Dorsal ","Tempo Natação","Dorsal ","Tempo Natação","Dorsal ","Tempo Natação","Dorsal ","Tempo Natação","Dorsal ","Tempo Natação","Dorsal ","Tempo Natação","Dorsal ","Tempo Natação","Dorsal ","Tempo Natação"]
[]
[]
[null,null,null,null,null,"Nº de Serie:",5]
["BEN.","M","BEN.","F","INF","M","INF","F","INI","M","INI","F","JUV","M","JUV","M","EST","BEN/INF","EST","INI/JUV"]
["Dorsal ","Tempo Natação","Dorsal ","Tempo Natação","Dorsal ","Tempo Natação","Dorsal ","Tempo Natação","Dorsal ","Tempo Natação","Dorsal ","Tempo Natação","Dorsal ","Tempo Natação","Dorsal ","Tempo Natação","Dorsal ","Tempo Natação","Dorsal ","Tempo Natação"]
[]
[]
[]
[null,"Obs.:"]